Target
5-hydroxytryptamine receptor 1A
Ligand
BDBM50265775
Substrate
Meas. Tech.
ChEMBL_558363 (CHEMBL954165)
Ki
5±n/a nM
Citation
 Butini, SGemma, SCampiani, GFranceschini, STrotta, FBorriello, MCeres, NRos, SCoccone, SSBernetti, MDe Angelis, MBrindisi, MNacci, VFiorini, INovellino, ECagnotto, AMennini, TSandager-Nielsen, KAndreasen, JTScheel-Kruger, JMikkelsen, JDFattorusso, C Discovery of a new class of potential multifunctional atypical antipsychotic agents targeting dopamine D3 and serotonin 5-HT1A and 5-HT2A receptors: design, synthesis, and effects on behavior. J Med Chem 52:151-69 (2009)  
Target
Name:
5-hydroxytryptamine receptor 1A
Synonyms:
5-HT-1A 5-HT1A 5-hydroxytryptamine receptor 1A (5HT1A) 5ht1a Htr1a Serotonin 1a (5-HT1a) receptor/Adrenergic receptor alpha-1 | Serotonin receptor 1A
Type:
G Protein-Coupled Receptor (GPCR)
Mol. Mass.:
46445.29
Organism:
Rattus norvegicus (rat)
Description:
Binding assays were performed using rat hippocampal membranes.
Residue:
422
  
Inhibitor
Name:
BDBM50265775
Synonyms:
CHEMBL462508 | N-[4-[4-(2,3-Dichlorophenyl)piperazin-1-yl]butyl]isoquinoline-3-carboxamide
Type:
Small organic molecule
Emp. Form.:
C24H26Cl2N4O
Mol. Mass.:
457.395
SMILES:
Clc1cccc(N2CCN(CCCCNC(=O)c3cc4ccccc4cn3)CC2)c1Cl
: