Target
D(3) dopamine receptor
Ligand
BDBM50265776
Substrate
Meas. Tech.
ChEMBL_558362 (CHEMBL954164)
Ki
0.27±n/a nM
Citation
 Butini, SGemma, SCampiani, GFranceschini, STrotta, FBorriello, MCeres, NRos, SCoccone, SSBernetti, MDe Angelis, MBrindisi, MNacci, VFiorini, INovellino, ECagnotto, AMennini, TSandager-Nielsen, KAndreasen, JTScheel-Kruger, JMikkelsen, JDFattorusso, C Discovery of a new class of potential multifunctional atypical antipsychotic agents targeting dopamine D3 and serotonin 5-HT1A and 5-HT2A receptors: design, synthesis, and effects on behavior. J Med Chem 52:151-69 (2009)  
Target
Name:
D(3) dopamine receptor
Synonyms:
DOPAMINE D3 DRD3_HUMAN Dopamine D3 receptor (D3) Dopamine receptor Dopamine receptor D3
Type:
Mol. Mass.:
44243.43
Organism:
Homo sapiens (Human)
Description:
Residue:
400
  
Inhibitor
Name:
BDBM50265776
Synonyms:
CHEMBL461236 | N-[4-[4-(3-Chlorophenyl)piperazin-1-yl]butyl]isoquinoline-3-carboxamide
Type:
Small organic molecule
Emp. Form.:
C24H27ClN4O
Mol. Mass.:
422.95
SMILES:
Clc1cccc(c1)N1CCN(CCCCNC(=O)c2cc3ccccc3cn2)CC1
: