Target
Cannabinoid receptor 1
Ligand
BDBM50277309
Substrate
Meas. Tech.
ChEMBL_540511 (CHEMBL1030615)
Ki
470±n/a nM
Citation
 Goodman, AJAjello, CWWorm, KLe Bourdonnec, BSavolainen, MAO'Hare, HCassel, JAStabley, GJDehaven, RNLabuda, CJKoblish, MLittle, PJBrogdon, BLSmith, SADolle, RE CB2 selective sulfamoyl benzamides: optimization of the amide functionality. Bioorg Med Chem Lett 19:309-13 (2008)  
Target
Name:
Cannabinoid receptor 1
Synonyms:
CANN6 CB-R CNR CNR1_HUMAN Cannabinoid receptor Cannabinoid receptor 1 (brain)
Type:
G Protein-Coupled Receptor (GPCR)
Mol. Mass.:
52868.96
Organism:
Homo sapiens (Human)
Description:
P21554
Residue:
472
  
Inhibitor
Name:
BDBM50277309
Synonyms:
3,3,3-trifluoro-2-methyl-N-(4-methyl-3-(morpholinosulfonyl)phenyl)-2-(trifluoromethyl)propanamide | CHEMBL511150
Type:
Small organic molecule
Emp. Form.:
C16H18F6N2O4S
Mol. Mass.:
448.381
SMILES:
Cc1ccc(NC(=O)C(C)(C(F)(F)F)C(F)(F)F)cc1S(=O)(=O)N1CCOCC1
: