Target
Metabotropic glutamate receptor 1
Ligand
BDBM50258140
Substrate
Meas. Tech.
ChEMBL_566316 (CHEMBL956826)
EC50
202±n/a nM
Citation
 Vieira, EHuwyler, JJolidon, SKnoflach, FMutel, VWichmann, J Fluorinated 9H-xanthene-9-carboxylic acid oxazol-2-yl-amides as potent, orally available mGlu1 receptor enhancers. Bioorg Med Chem Lett 19:1666-9 (2009)  
Target
Name:
Metabotropic glutamate receptor 1
Synonyms:
GRM1_RAT Grm1 Metabotropic glutamate receptor Mglur1 metabotropic glutamate 1/5-D metabotropic glutamate receptor 1 isoform alpha precursor
Type:
Enzyme Catalytic Domain
Mol. Mass.:
133240.47
Organism:
RAT
Description:
metabotropic glutamate 1/2 0 RAT::P23385
Residue:
1199
  
Inhibitor
Name:
BDBM50258140
Synonyms:
CHEMBL521982 | N-(4-(trifluoromethyl)oxazol-2-yl)-9H-xanthene-9-carboxamide
Type:
Small organic molecule
Emp. Form.:
C18H11F3N2O3
Mol. Mass.:
360.2867
SMILES:
FC(F)(F)c1coc(NC(=O)C2c3ccccc3Oc3ccccc23)n1
: