Target
5-hydroxytryptamine receptor 3A
Ligand
BDBM50108392
Substrate
Meas. Tech.
ChEMBL_564428 (CHEMBL964233)
Ki
2.8±n/a nM
Citation
 Lemaître, SLepailleur, ABureau, RButt-Gueulle, SLelong-Boulouard, VDuchatelle, PBoulouard, MDumuis, ADaveu, CLezoualc'h, FPfeiffer, BDauphin, FRault, S Novel antagonists of serotonin-4 receptors: synthesis and biological evaluation of pyrrolothienopyrazines. Bioorg Med Chem 17:2607-22 (2009)  
Target
Name:
5-hydroxytryptamine receptor 3A
Synonyms:
5-HT-3 5-HT3A 5-hydroxytryptamine receptor 3 (5-HT3) 5-hydroxytryptamine receptor 3A (5HT3A) 5HT3R HTR3A Serotonin 3 receptor (5HT3) Serotonin-gated ion channel receptor | Serotonin-gated ion channel receptor 3
Type:
Protein
Mol. Mass.:
55283.27
Organism:
Homo sapiens (Human)
Description:
P46098
Residue:
478
  
Inhibitor
Name:
BDBM50108392
Synonyms:
(3-ENDO)-8-METHYL-8-AZABICYCLO[3.2.1]OCT-3-YL 1H-INDOLE-3-CARBOXYLATE | CHEMBL56564
Type:
Small organic molecule
Emp. Form.:
C17H20N2O2
Mol. Mass.:
284.3529
SMILES:
CN1[C@H]2CC[C@@H]1C[C@@H](C2)OC(=O)c1c[nH]c2ccccc12
: