Target
Cholecystokinin receptor type A
Ligand
BDBM50185262
Substrate
Meas. Tech.
ChEMBL_564596 (CHEMBL964036)
IC50
16400±n/a nM
Citation
 Lassiani, LPavan, MVBerti, FKokotos, GMarkidis, TMennuni, LMakovec, FVarnavas, A Anthranilic acid based CCK1 receptor antagonists: blocking the receptor with the same 'words' of the endogenous ligand. Bioorg Med Chem 17:2336-50 (2009)  
Target
Name:
Cholecystokinin receptor type A
Synonyms:
CCK-A receptor CCK1-R CCKAR_CAVPO Cholecystokinin receptor type A | Cholecystokinin-1 receptor
Type:
Mol. Mass.:
48229.77
Organism:
Cavia porcellus
Description:
Residue:
430
  
Inhibitor
Name:
BDBM50185262
Synonyms:
(+/-)-2-(2-(1H-indole-2-carboxamido)benzamido)-3-phenylpropanoic acid 2-(2-(1H-indole-2-carboxamido)benzamido)-3-phenylpropanoic acid | CHEMBL202861
Type:
Small organic molecule
Emp. Form.:
C25H21N3O4
Mol. Mass.:
427.4519
SMILES:
OC(=O)C(Cc1ccccc1)NC(=O)c1ccccc1NC(=O)c1cc2ccccc2[nH]1
: