Target
Cholecystokinin receptor type A
Ligand
BDBM50278303
Substrate
Meas. Tech.
ChEMBL_564596 (CHEMBL964036)
IC50
16900±n/a nM
Citation
 Lassiani, LPavan, MVBerti, FKokotos, GMarkidis, TMennuni, LMakovec, FVarnavas, A Anthranilic acid based CCK1 receptor antagonists: blocking the receptor with the same 'words' of the endogenous ligand. Bioorg Med Chem 17:2336-50 (2009)  
Target
Name:
Cholecystokinin receptor type A
Synonyms:
CCK-A receptor CCK1-R CCKAR_CAVPO Cholecystokinin receptor type A | Cholecystokinin-1 receptor
Type:
Mol. Mass.:
48229.77
Organism:
Cavia porcellus
Description:
Residue:
430
  
Inhibitor
Name:
BDBM50278303
Synonyms:
3-(R,S)-{2-[(1H-Indole-2-carbonyl)-amino]-benzoylamino}-4-phenyl-butyric acid | CHEMBL469979
Type:
Small organic molecule
Emp. Form.:
C26H23N3O4
Mol. Mass.:
441.4785
SMILES:
OC(=O)CC(Cc1ccccc1)NC(=O)c1ccccc1NC(=O)c1cc2ccccc2[nH]1
: