Target
Thromboxane A2 receptor
Ligand
BDBM50277939
Substrate
Meas. Tech.
ChEMBL_501283 (CHEMBL971469)
Ki
42±n/a nM
Citation
 Leblanc, YRoy, PDufresne, CLachance, NWang, ZO'Neill, GGreig, GDenis, DMathieu, MCSlipetz, DSawyer, NTsou, N Discovery of potent and selective DP1 receptor antagonists in the azaindole series. Bioorg Med Chem Lett 19:2125-8 (2009)  
Target
Name:
Thromboxane A2 receptor
Synonyms:
Prostanoid TP receptor TBXA2R Thromboxane Thromboxane Beta
Type:
Enyzme
Mol. Mass.:
37445.28
Organism:
Homo sapiens (Human)
Description:
P21731
Residue:
343
  
Inhibitor
Name:
BDBM50277939
Synonyms:
(+/-)-2-(4-(methylsulfonyl)-5-(naphthalen-1-ylthio)-6,7,8,9-tetrahydropyrido[3,2-b]indolizin-6-yl)acetic acid | CHEMBL519862
Type:
Small organic molecule
Emp. Form.:
C24H22N2O4S2
Mol. Mass.:
466.572
SMILES:
CS(=O)(=O)c1ccnc2n3CCCC(CC(O)=O)c3c(Sc3cccc4ccccc34)c12
: