Target
Nociceptin receptor
Ligand
BDBM50259516
Substrate
Meas. Tech.
ChEMBL_500674 (CHEMBL966890)
Ki
11±n/a nM
Citation
 Ho, GDAnthes, JBercovici, ACaldwell, JPCheng, KCCui, XFawzi, AFernandez, XGreenlee, WJHey, JKorfmacher, WLu, SXMcLeod, RLNg, FTorhan, ASTan, ZTulshian, DVarty, GBXu, XZhang, H The discovery of tropane derivatives as nociceptin receptor ligands for the management of cough and anxiety. Bioorg Med Chem Lett 19:2519-23 (2009)  
Target
Name:
Nociceptin receptor
Synonyms:
KOR-3 Mu-type opioid receptor (Mu) Nociceptin Receptor (ORL1 Receptor) Nociceptin receptor (ORL-1) Nociceptin/Orphanin FQ, NOP receptor OPIATE ORL-1 OPRL1 protein ORL1 Opioid receptor like-1 Orphanin FQ receptor (ORL1) | P41146
Type:
G Protein-Coupled Receptor (GPCR)
Mol. Mass.:
40702.87
Organism:
Homo sapiens (Human)
Description:
P41146
Residue:
370
  
Inhibitor
Name:
BDBM50259516
Synonyms:
8-(bis(2-chlorophenyl)methyl)-N-(2-hydroxypropyl)-3-phenyl-8-azabicyclo[3.2.1]octane-3-carboxamide | CHEMBL466694
Type:
Small organic molecule
Emp. Form.:
C30H32Cl2N2O2
Mol. Mass.:
523.493
SMILES:
CC(O)CNC(=O)C1(CC2CCC(C1)N2C(c1ccccc1Cl)c1ccccc1Cl)c1ccccc1
: