Target
Aldo-keto reductase family 1 member C1
Ligand
BDBM50219490
Substrate
Meas. Tech.
ChEMBL_498210 (CHEMBL968790)
IC50
460±n/a nM
Citation
 El-Kabbani, OScammells, PJGosling, JDhagat, UEndo, SMatsunaga, TSoda, MHara, A Structure-guided design, synthesis, and evaluation of salicylic acid-based inhibitors targeting a selectivity pocket in the active site of human 20alpha-hydroxysteroid dehydrogenase (AKR1C1). J Med Chem 52:3259-64 (2009)  
Target
Name:
Aldo-keto reductase family 1 member C1
Synonyms:
20-alpha-HSD AK1C1_HUMAN Aldo-keto reductase family 1 member C1 (AK1C1) Aldo-keto reductase family 1 member C1 (AKR1C1) DDH High-affinity hepatic bile acid-binding protein | Trans-1,2-dihydrobenzene-1,2-diol dehydrogenase
Type:
Enzyme
Mol. Mass.:
36793.97
Organism:
Homo sapiens (Human)
Description:
Recombinant AKR1C1 enzyme was expressed in E. coli.
Residue:
323
  
Inhibitor
Name:
BDBM50219490
Synonyms:
3-Bromo-5-phenylsalicylc acid CHEMBL387536
Type:
Small organic molecule
Emp. Form.:
C13H9BrO3
Mol. Mass.:
293.113
SMILES:
OC(=O)c1cc(cc(Br)c1O)-c1ccccc1
: