Target
Aldo-keto reductase family 1 member C3
Ligand
BDBM50219490
Substrate
Meas. Tech.
ChEMBL_498203 (CHEMBL980735)
Ki
4200±n/a nM
Citation
 El-Kabbani, OScammells, PJGosling, JDhagat, UEndo, SMatsunaga, TSoda, MHara, A Structure-guided design, synthesis, and evaluation of salicylic acid-based inhibitors targeting a selectivity pocket in the active site of human 20alpha-hydroxysteroid dehydrogenase (AKR1C1). J Med Chem 52:3259-64 (2009)  
Target
Name:
Aldo-keto reductase family 1 member C3
Synonyms:
17-beta-Hydroxysteroid Dehydrogenase 5 (17-beta-HSD5, AKR1C3) AK1C3_HUMAN Aldo-keto reductase family 1 member C3 Aldo-keto reductase family 1 member C3 (AK1C3a) Aldo-keto-reductase family 1 member C3 Dihydrodiol dehydrogenase 3 Estradiol 17-beta-dehydrogenase KIAA0119 Prostaglandin F synthase Trans-1,2-dihydrobenzene-1,2-diol dehydrogenase
Type:
Enzyme
Mol. Mass.:
36859.86
Organism:
Homo sapiens (Human)
Description:
P42330
Residue:
323
  
Inhibitor
Name:
BDBM50219490
Synonyms:
3-Bromo-5-phenylsalicylc acid CHEMBL387536
Type:
Small organic molecule
Emp. Form.:
C13H9BrO3
Mol. Mass.:
293.113
SMILES:
OC(=O)c1cc(cc(Br)c1O)-c1ccccc1
: