Target
Alpha-1B adrenergic receptor
Ligand
BDBM50258593
Substrate
Meas. Tech.
ChEMBL_500046 (CHEMBL970449)
EC50
>10000±n/a nM
Citation
 Roberts, LRFish, PVIan Storer, RWhitlock, GA 6,7-Dihydro-5H-pyrrolo[1,2-a] imidazoles as potent and selective alpha1A adrenoceptor partial agonists. Bioorg Med Chem Lett 19:3113-7 (2009)  
Target
Name:
Alpha-1B adrenergic receptor
Synonyms:
ADA1B_HUMAN Adrenergic alpha1B Adrenergic receptor alpha Alpha 1B-adrenoreceptor | Alpha-1B adrenergic receptor
Type:
Enzyme
Mol. Mass.:
56862.13
Organism:
Homo sapiens (Human)
Description:
P35368
Residue:
520
  
Inhibitor
Name:
BDBM50258593
Synonyms:
6-(4-fluoro-2-(pyrimidin-5-yl)phenyl)-6,7-dihydro-5H-pyrrolo[1,2-a]imidazole | CHEMBL505414
Type:
Small organic molecule
Emp. Form.:
C16H13FN4
Mol. Mass.:
280.2996
SMILES:
Fc1ccc(C2Cc3nccn3C2)c(c1)-c1cncnc1
: