Target
5-hydroxytryptamine receptor 3A
Ligand
BDBM50258294
Substrate
Meas. Tech.
ChEMBL_523350 (CHEMBL1006686)
Ki
7.3±n/a nM
Citation
 Morelli, EGemma, SBudriesi, RCampiani, GNovellino, EFattorusso, CCatalanotti, BCoccone, SSRos, SBorrelli, GPersico, MFiorini, INacci, VIoan, PChiarini, AHamon, MCagnotto, AMennini, TFracasso, CColovic, MCaccia, SButini, S Specific targeting of peripheral serotonin 5-HT(3) receptors. Synthesis, biological investigation, and structure-activity relationships. J Med Chem 52:3548-62 (2009)  
Target
Name:
5-hydroxytryptamine receptor 3A
Synonyms:
5-HT3 5HT3A_RAT Htr3 Serotonin (5-HT) receptor | Zacopride site-R
Type:
Enzyme Catalytic Domain
Mol. Mass.:
55428.70
Organism:
RAT
Description:
5-HT3 HTR3A RAT::P35563
Residue:
483
  
Inhibitor
Name:
BDBM50258294
Synonyms:
2-[4-(7-Fluoropyrrolo[1,2-a]quinoxalin-4-yl)-piperazin-1-yl]acetamide | CHEMBL493183
Type:
Small organic molecule
Emp. Form.:
C17H18FN5O
Mol. Mass.:
327.3561
SMILES:
NC(=O)CN1CCN(CC1)c1nc2cc(F)ccc2n2cccc12
: