Target
5-hydroxytryptamine receptor 3A
Ligand
BDBM50258462
Substrate
Meas. Tech.
ChEMBL_523350 (CHEMBL1006686)
Ki
2.8±n/a nM
Citation
 Morelli, EGemma, SBudriesi, RCampiani, GNovellino, EFattorusso, CCatalanotti, BCoccone, SSRos, SBorrelli, GPersico, MFiorini, INacci, VIoan, PChiarini, AHamon, MCagnotto, AMennini, TFracasso, CColovic, MCaccia, SButini, S Specific targeting of peripheral serotonin 5-HT(3) receptors. Synthesis, biological investigation, and structure-activity relationships. J Med Chem 52:3548-62 (2009)  
Target
Name:
5-hydroxytryptamine receptor 3A
Synonyms:
5-HT3 5HT3A_RAT Htr3 Serotonin (5-HT) receptor | Zacopride site-R
Type:
Enzyme Catalytic Domain
Mol. Mass.:
55428.70
Organism:
RAT
Description:
5-HT3 HTR3A RAT::P35563
Residue:
483
  
Inhibitor
Name:
BDBM50258462
Synonyms:
(S)-2-Amino-3-[4-(7-fluoropyrrolo[1,2-a]quinoxalin-4-yl)piperazin-1-yl]propionic Acid | CHEMBL511555
Type:
Small organic molecule
Emp. Form.:
C18H20FN5O2
Mol. Mass.:
357.3821
SMILES:
N[C@@H](CN1CCN(CC1)c1nc2cc(F)ccc2n2cccc12)C(O)=O
: