Target
5-hydroxytryptamine receptor 1A
Ligand
BDBM50258495
Substrate
Meas. Tech.
ChEMBL_523351 (CHEMBL1006687)
Ki
480±n/a nM
Citation
 Morelli, EGemma, SBudriesi, RCampiani, GNovellino, EFattorusso, CCatalanotti, BCoccone, SSRos, SBorrelli, GPersico, MFiorini, INacci, VIoan, PChiarini, AHamon, MCagnotto, AMennini, TFracasso, CColovic, MCaccia, SButini, S Specific targeting of peripheral serotonin 5-HT(3) receptors. Synthesis, biological investigation, and structure-activity relationships. J Med Chem 52:3548-62 (2009)  
Target
Name:
5-hydroxytryptamine receptor 1A
Synonyms:
5-HT-1A 5-HT1A 5-hydroxytryptamine receptor 1A (5HT1A) 5ht1a Htr1a Serotonin 1a (5-HT1a) receptor/Adrenergic receptor alpha-1 | Serotonin receptor 1A
Type:
G Protein-Coupled Receptor (GPCR)
Mol. Mass.:
46445.29
Organism:
Rattus norvegicus (rat)
Description:
Binding assays were performed using rat hippocampal membranes.
Residue:
422
  
Inhibitor
Name:
BDBM50258495
Synonyms:
(R)-2-Amino-3-[4-(7-fluoropyrrolo[1,2-a]quinoxalin-4-yl)piperazin-1-yl]propionic Acid | CHEMBL466462
Type:
Small organic molecule
Emp. Form.:
C18H20FN5O2
Mol. Mass.:
357.3821
SMILES:
N[C@H](CN1CCN(CC1)c1nc2cc(F)ccc2n2cccc12)C(O)=O
: