Target
72 kDa type IV collagenase
Ligand
BDBM50268906
Substrate
Meas. Tech.
ChEMBL_523764 (CHEMBL1008372)
IC50
8±n/a nM
Citation
 Burns, DMLi, YLShi, EHe, CXu, MZhuo, JZhang, CQian, DQLi, YWynn, RCovington, MBKatiyar, KMarando, CAFridman, JSScherle, PFriedman, SMetcalf, BYao, W Compelling P1 substituent affect on metalloprotease binding profile enables the design of a novel cyclohexyl core scaffold with excellent MMP selectivity and HER-2 sheddase inhibition. Bioorg Med Chem Lett 19:3525-30 (2009)  
Target
Name:
72 kDa type IV collagenase
Synonyms:
72 kDa gelatinase CLG4A Gelatinase A (MMP-2) MMP2_HUMAN Matrix metalloproteinase-2 (MMP 2) Matrix metalloproteinases 2 (MMP-2) | TBE-1
Type:
Enzyme
Mol. Mass.:
73870.36
Organism:
Homo sapiens (Human)
Description:
P08253
Residue:
660
  
Inhibitor
Name:
BDBM50268906
Synonyms:
(2S,3S,5RS)-N-hydroxy-5-(2-oxo-2-(pyrrolidin-1-yl)ethyl)-2-(4-phenylpiperazine-1-carbonyl)piperidine-3-carboxamide | CHEMBL495596
Type:
Small organic molecule
Emp. Form.:
C23H33N5O4
Mol. Mass.:
443.5392
SMILES:
ONC(=O)[C@H]1CC(CC(=O)N2CCCC2)CN[C@@H]1C(=O)N1CCN(CC1)c1ccccc1
: