Target
Nitric oxide synthase, brain
Ligand
BDBM50279358
Substrate
Meas. Tech.
ChEMBL_545777 (CHEMBL1027672)
IC50
15300±n/a nM
Citation
 Fang, JJi, HLawton, GRXue, FRoman, LJSilverman, RB L337H mutant of rat neuronal nitric oxide synthase resembles human neuronal nitric oxide synthase toward inhibitors. J Med Chem 52:4533-7 (2009)  
Target
Name:
Nitric oxide synthase, brain
Synonyms:
Constitutive NOS NC-NOS NOS type I nNOS NOS1_HUMAN Neuronal nitric oxide synthase Nitric oxide synthase, neuronal (nNOS) bNOS | nNOS
Type:
Homodimer
Mol. Mass.:
160985.98
Organism:
Homo sapiens (Human)
Description:
P29475
Residue:
1434
  
Inhibitor
Name:
BDBM50279358
Synonyms:
(+/-)-N1-(4-((6-aminopyridin-2-yl)methyl)pyrrolidin-3-yl)ethane-1,2-diamine | CHEMBL483940
Type:
Small organic molecule
Emp. Form.:
C12H21N5
Mol. Mass.:
235.3286
SMILES:
NCCNC1CNCC1Cc1cccc(N)n1
: