Target
Prolyl endopeptidase
Ligand
BDBM50279827
Substrate
Meas. Tech.
ChEBML_157466
Ki
2.4±n/a nM
KOFF
0.000300 s-1
KON
140000 M-1s-1
Citation
 Bakker, AVDaffeh, JJung, SVincent, LANagel, AASpencer, RWVinick, FJFaraci, WS Novel in vitro and in vivo inhibitors of prolyl endopeptidase Bioorg Med Chem Lett 1:585-590 (1991)    Article 
Target
Name:
Prolyl endopeptidase
Synonyms:
PE Pep Prep
Type:
PROTEIN
Mol. Mass.:
80738.55
Organism:
Mus musculus
Description:
ChEMBL_1336164
Residue:
710
  
Inhibitor
Name:
BDBM50279827
Synonyms:
2-((S)-2-Formyl-pyrrolidine-1-carbonyl)-2,3-dihydro-indole-1-carboxylic acid benzyl ester | CHEMBL345903
Type:
Small organic molecule
Emp. Form.:
C22H22N2O4
Mol. Mass.:
378.4211
SMILES:
O=C[C@@H]1CCCN1C(=O)C1Cc2ccccc2N1C(=O)OCc1ccccc1
: