Target
Neutral alpha-glucosidase AB
Ligand
BDBM50280030
Substrate
Meas. Tech.
ChEMBL_218088 (CHEMBL822535)
pH
8±n/a
Ki
8000±n/a nM
Comments
extracted
Citation
 Berger, ADax, KGradnig, GGrassberger, VStütz, AEUngerank, MLegler, GBause, E Synthesis and biological activity of C-6 modified derivatives of the glucosidase inhibitor 1-deoxynojirimycin. Bioorg Med Chem Lett 2:27-32 (1992)    Article 
Target
Name:
Neutral alpha-glucosidase AB
Synonyms:
Alpha-glucosidase 2 GANAB Glucosidase II subunit alpha | KIAA0088
Type:
PROTEIN
Mol. Mass.:
106864.62
Organism:
Homo sapiens (Human)
Description:
ChEMBL_218093
Residue:
944
  
Inhibitor
Name:
BDBM50280030
Synonyms:
(2S,3R,4R,5S)-2-Fluoromethyl-piperidine-3,4,5-triol | CHEMBL111326
Type:
Small organic molecule
Emp. Form.:
C6H12FNO3
Mol. Mass.:
165.1628
SMILES:
O[C@H]1CN[C@H](CF)[C@@H](O)[C@@H]1O
: