Target
Neutrophil elastase
Ligand
BDBM50014735
Substrate
Meas. Tech.
ChEBML_63968
Ki
1±n/a nM
Citation
 Angelastro, MRBey, PMehdi, SPeet, NP Synthesis of a peptidyl 2,2-difluoro-3-aminopropionate Bioorg Med Chem Lett 2:1235-1238 (1992)    Article 
Target
Name:
Neutrophil elastase
Synonyms:
Bone marrow serine protease Coagulation factor X ELANE Elastase HLE Leukocyte elastase Medullasin Neutrophil elastase (HNE) PMN elastase Trypsin
Type:
Enzyme
Mol. Mass.:
28532.38
Organism:
Homo sapiens (Human)
Description:
P08246
Residue:
267
  
Inhibitor
Name:
BDBM50014735
Synonyms:
(1-{1-Methyl-2-oxo-2-[2-(3,3,3-trifluoro-1-isopropyl-2-oxo-propylcarbamoyl)-pyrrolidin-1-yl]-ethylcarbamoyl}-ethyl)-carbamic acid benzyl ester | CHEMBL336171
Type:
Small organic molecule
Emp. Form.:
C25H33F3N4O6
Mol. Mass.:
542.5479
SMILES:
CC(C)[C@H](NC(=O)[C@@H]1CCCN1C(=O)[C@H](C)NC(=O)[C@H](C)NC(=O)OCc1ccccc1)C(=O)C(F)(F)F
: