Target
Adenosylhomocysteinase
Ligand
BDBM50280301
Substrate
Meas. Tech.
ChEBML_197371
Ki
40±n/a nM
Citation
 Liu, SWolfe, MSYuan, CAli, SMBorchardt, RT Synthesis and evaluation of 4′-5′-dehydro-5′-fluoroaristeromycins as S-adenosyl-L-homocysteine (AdoHcy) hydrolase inhibitors Bioorg Med Chem Lett 2:1741-1744 (1992)    Article 
Target
Name:
Adenosylhomocysteinase
Synonyms:
Adenosylhomocysteinase SAHH_RAT
Type:
PROTEIN
Mol. Mass.:
47537.52
Organism:
Rattus norvegicus
Description:
ChEMBL_1507790
Residue:
432
  
Inhibitor
Name:
BDBM50280301
Synonyms:
(2R,3R,4S)-2-(6-Amino-purin-9-yl)-5-[1-fluoro-meth-(E)-ylidene]-tetrahydro-furan-3,4-diol | CHEMBL297437
Type:
Small organic molecule
Emp. Form.:
C10H10FN5O3
Mol. Mass.:
267.2165
SMILES:
Nc1ncnc2n(cnc12)[C@@H]1O\C(=C\F)[C@@H](O)[C@H]1O
: