Target
Type-1 angiotensin II receptor
Ligand
BDBM50280321
Substrate
Meas. Tech.
ChEBML_36160
IC50
120±n/a nM
Citation
 Murray, WVLalan, PGill, AAddo, MFLewis, JMLee, DKRampulla, RWachter, MPHsi, JDUnderwood, DC Substituted piperidin-2-one biphenyltetrazoles as angiotensin II antagonists Bioorg Med Chem Lett 2:1775-1779 (1992)    Article 
Target
Name:
Type-1 angiotensin II receptor
Synonyms:
AGTR1 Angiotensin II type 1a (AT-1a) receptor
Type:
PROTEIN
Mol. Mass.:
41107.81
Organism:
Bos taurus
Description:
ChEMBL_36779
Residue:
359
  
Inhibitor
Name:
BDBM50280321
Synonyms:
CHEMBL296731 | [4-Isopropyl-4-methyl-6-oxo-1-[2'-(1H-tetrazol-5-yl)-biphenyl-4-ylmethyl]-piperidin-(2E)-ylidene]-acetic acid ethyl ester
Type:
Small organic molecule
Emp. Form.:
C27H31N5O3
Mol. Mass.:
473.5667
SMILES:
CCOC(=O)\C=C1/CC(C)(CC(=O)N1Cc1ccc(cc1)-c1ccccc1-c1nnn[nH]1)C(C)C
: