Target
Type-1 angiotensin II receptor
Ligand
BDBM50280331
Substrate
Meas. Tech.
ChEBML_36160
IC50
540±n/a nM
Citation
 Murray, WVLalan, PGill, AAddo, MFLewis, JMLee, DKRampulla, RWachter, MPHsi, JDUnderwood, DC Substituted piperidin-2-one biphenyltetrazoles as angiotensin II antagonists Bioorg Med Chem Lett 2:1775-1779 (1992)    Article 
Target
Name:
Type-1 angiotensin II receptor
Synonyms:
AGTR1 Angiotensin II type 1a (AT-1a) receptor
Type:
PROTEIN
Mol. Mass.:
41107.81
Organism:
Bos taurus
Description:
ChEMBL_36779
Residue:
359
  
Inhibitor
Name:
BDBM50280331
Synonyms:
CHEMBL49192 | [9-Oxo-8-[2'-(1H-tetrazol-5-yl)-biphenyl-4-ylmethyl]-8-aza-spiro[4.5]dec-(7E)-ylidene]-acetic acid ethyl ester
Type:
Small organic molecule
Emp. Form.:
C27H29N5O3
Mol. Mass.:
471.5509
SMILES:
CCOC(=O)\C=C1/CC2(CCCC2)CC(=O)N1Cc1ccc(cc1)-c1ccccc1-c1nnn[nH]1
: