Target
Adenosine receptor A1
Ligand
BDBM50281130
Substrate
Meas. Tech.
ChEBML_29639
Ki
17±n/a nM
Citation
 Knutsen, LJLau, JSheardown, MJThomsen, C The synthesis and biochemical evaluation of new A1 selective adenosine receptor agonists containing 6-hydrazinopurine moieties Bioorg Med Chem Lett 3:2661-2666 (1993)    Article 
Target
Name:
Adenosine receptor A1
Synonyms:
AA1R_RAT ADENOSINE A1 high Adenosine A1 receptor (A1) Adenosine receptors A1 | Adora1
Type:
Protein
Mol. Mass.:
36704.13
Organism:
Rattus norvegicus (rat)
Description:
Residue:
326
  
Inhibitor
Name:
BDBM50281130
Synonyms:
(2R,3R,4S,5R)-2-[6-(4-Benzenesulfonyl-piperidin-1-ylamino)-2-chloro-purin-9-yl]-5-hydroxymethyl-tetrahydro-furan-3,4-diol | CHEMBL88963
Type:
Small organic molecule
Emp. Form.:
C21H25ClN6O6S
Mol. Mass.:
524.978
SMILES:
OC[C@H]1O[C@H]([C@H](O)[C@@H]1O)n1cnc2c(NN3CCC(CC3)S(=O)(=O)c3ccccc3)nc(Cl)nc12
: