Target
Substance-P receptor
Ligand
BDBM50449783
Substrate
Meas. Tech.
ChEBML_143044
IC50
31±n/a nM
Citation
 Wang, JxBray, AMDiPasquale, AJMaeji, NGeysen, H Application of the multipin peptide synthesis technique for peptide receptor binding studies: Substance P as A model system Bioorg Med Chem Lett 3:447-450 (1993)    Article 
Target
Name:
Substance-P receptor
Synonyms:
NK-1 receptor NK1 Receptor Neurokinin 1 receptor SPR Tac1r Tacr1
Type:
G Protein-Coupled Receptor (GPCR)
Mol. Mass.:
46371.54
Organism:
Rattus norvegicus (rat)
Description:
Competition binding assays were carried out using membrane preparations from transfected CHO cells that constitutively expressed the rat NK1 receptor.
Residue:
407
  
Inhibitor
Name:
BDBM50449783
Synonyms:
CHEMBL2370873
Type:
Small organic molecule
Emp. Form.:
C54H85N13O15S
Mol. Mass.:
1188.396
SMILES:
CC[C@H](C)[C@H](NC(=O)[C@H](Cc1ccccc1)NC(=O)[C@H](C)NC(=O)[C@H](CC(O)=O)NC(=O)[C@H](CCCCN)NC(=O)[C@H](CO)NC(=O)[C@@H]1CCCN1C(=O)[C@@H]1CCC(=O)N1)C(=O)NCC(=O)N[C@@H](CC(C)C)C(=O)N[C@H](CCSC)C(N)=O
: