Target
Gag-Pol polyprotein [489-587]
Ligand
BDBM50283118
Substrate
Meas. Tech.
ChEBML_79469
IC50
220±n/a nM
Citation
 Kim, BVacca, JPFitzgerald, PMDarke, PLHolloway, MGuare, JPHanifin, CMArford-Bickerstaff, DJZugay, JAWai, JMAnderson, PSHuff, JR Novel conformationally constrained HIV-1 protease inhibitors: rational design, enzyme inhibition, and X-ray structure of an enzyme-inhibtor complex Bioorg Med Chem Lett 4:2199-2204 (1994)    Article 
Target
Name:
Gag-Pol polyprotein [489-587]
Synonyms:
Human immunodeficiency virus type 1 protease Pol polyprotein | gag-pol
Type:
Enzyme Subunit
Mol. Mass.:
10781.16
Organism:
Human immunodeficiency virus type 1
Description:
P04585[489-587]
Residue:
99
  
Inhibitor
Name:
BDBM50283118
Synonyms:
CHEMBL273775 | [(S)-1-((S)-1-{(S)-3-Hydroxy-1-[(S)-1-((1S,2R)-2-hydroxy-indan-1-ylcarbamoyl)-2-phenyl-ethyl]-pyrrolidin-3-yl}-2-phenyl-ethylcarbamoyl)-2-methyl-propyl]-carbamic acid benzyl ester
Type:
Small organic molecule
Emp. Form.:
C43H50N4O6
Mol. Mass.:
718.8803
SMILES:
CC(C)[C@H](NC(=O)OCc1ccccc1)C(=O)N[C@@H](Cc1ccccc1)[C@]1(O)CCN(C1)[C@@H](Cc1ccccc1)C(=O)N[C@@H]1[C@H](O)Cc2ccccc12
: