Target
5-hydroxytryptamine receptor 1A
Ligand
BDBM50284597
Substrate
Meas. Tech.
ChEMBL_1156 (CHEMBL616101)
Ki
81±n/a nM
Citation
 Kuroita, TIkebe, TMurakami, STakehara, SKawakita, T N-(2-pyrrolidinylmethyl)benzoxazine-8-carboxamides exhibiting high affinities for All of D2, 5-HT1 A, and 5-HT2 receptors Bioorg Med Chem Lett 5:1245-1250 (1995)    Article 
Target
Name:
5-hydroxytryptamine receptor 1A
Synonyms:
5-HT-1A 5-HT1A 5-hydroxytryptamine receptor 1A (5HT1A) 5ht1a Htr1a Serotonin 1a (5-HT1a) receptor/Adrenergic receptor alpha-1 | Serotonin receptor 1A
Type:
G Protein-Coupled Receptor (GPCR)
Mol. Mass.:
46445.29
Organism:
Rattus norvegicus (rat)
Description:
Binding assays were performed using rat hippocampal membranes.
Residue:
422
  
Inhibitor
Name:
BDBM50284597
Synonyms:
2-Methoxy-N-((S)-1-nonyl-pyrrolidin-2-ylmethyl)-5-sulfamoyl-benzamide | CHEMBL280912
Type:
Small organic molecule
Emp. Form.:
C22H37N3O4S
Mol. Mass.:
439.612
SMILES:
CCCCCCCCCN1CCC[C@H]1CNC(=O)c1cc(ccc1OC)S(N)(=O)=O
: