Target
Type-1 angiotensin II receptor
Ligand
BDBM50284998
Substrate
Meas. Tech.
ChEBML_36162
IC50
850±n/a nM
Citation
 Kohara, YImamiya, EKubo, KWada, TInada, YNaka, T A new class of angiotensin II receptor antagonists with a novel acidic bioisostere Bioorg Med Chem Lett 5:1903-1908 (1995)    Article 
Target
Name:
Type-1 angiotensin II receptor
Synonyms:
AGTR1 Angiotensin II type 1a (AT-1a) receptor
Type:
PROTEIN
Mol. Mass.:
41107.81
Organism:
Bos taurus
Description:
ChEMBL_36779
Residue:
359
  
Inhibitor
Name:
BDBM50284998
Synonyms:
3-[2'-(5-Oxo-4,5-dihydro-[1,2,4]oxadiazol-3-yl)-biphenyl-4-ylmethyl]-2-propylsulfanyl-3H-benzoimidazole-4-carboxylic acid | CHEMBL294598
Type:
Small organic molecule
Emp. Form.:
C26H22N4O4S
Mol. Mass.:
486.542
SMILES:
CCCSc1nc2cccc(C(O)=O)c2n1Cc1ccc(cc1)-c1ccccc1-c1nc(=O)o[nH]1
: