Target
Integrin alpha-IIb/beta-3
Ligand
BDBM50285024
Substrate
Meas. Tech.
ChEBML_218200
Ki
2.1±n/a nM
Citation
 Ojima, IDong, QChakravarty, SPeerschke, EHwang, SMWong, AS Design, synthesis and SAR of RGD peptide hybrids as highly efficient inhibitors of platelet aggregation Bioorg Med Chem Lett 5:1941-1946 (1995)    Article 
Target
Name:
Integrin alpha-IIb/beta-3
Synonyms:
Glycoprotein IIb/IIIa
Type:
Mol. Mass.:
Description:
ASSAY_ID of EBI is 30109
Components:
This complex has 2 components.
Component 1
Name:
Integrin beta-3
Synonyms:
CD_antigen=CD61 GPIIIa ITGB3 Platelet membrane glycoprotein IIIa
Type:
Protein
Mol. Mass.:
87038.91
Organism:
Homo sapiens (Human)
Description:
P05106
Residue:
788
  
Component 2
Name:
Integrin alpha-IIb
Synonyms:
CD_antigen=CD41 GPIIb Glycoprotein IIb ITGA2B Integrin alpha-IIb heavy chain Integrin alpha-IIb light chain, form 2 Integrin alpha-V/beta-3 and alpha-IIb/beta 3 | Platelet membrane glycoprotein IIb
Type:
Protein
Mol. Mass.:
113354.85
Organism:
Homo sapiens (Human)
Description:
P08514
Residue:
1039
  
Inhibitor
Name:
BDBM50285024
Synonyms:
3-[3-(4-Carbamimidoyl-benzoylamino)-propionylamino]-N-[(S)-1-carboxy-2-(4-hydroxy-phenyl)-ethyl]-succinamic acid | CHEMBL59048
Type:
Small organic molecule
Emp. Form.:
C24H27N5O8
Mol. Mass.:
513.4999
SMILES:
NC(=N)c1ccc(cc1)C(=O)NCCC(=O)N[C@@H](CC(O)=O)C(=O)N[C@H](Cc1ccc(O)cc1)C(O)=O
: