Target
5-hydroxytryptamine receptor 1D
Ligand
BDBM50285318
Substrate
Meas. Tech.
ChEMBL_1626 (CHEMBL616512)
IC50
3.35±n/a nM
Citation
 LeBoulluec, KLMattson, RJMahle, CDMcGovern, RTNowak, HPGentile, AJ Bivalent indoles exhibiting serotonergic binding affinity Bioorg Med Chem Lett 5:123-126 (1995)    Article 
Target
Name:
5-hydroxytryptamine receptor 1D
Synonyms:
5-HT-1D 5-HT1D 5HT1D_HUMAN HTR1DA Serotonin (5-HT) receptor | Serotonin Receptor 1D
Type:
G Protein-Coupled Receptor (GPCR)
Mol. Mass.:
41920.63
Organism:
Homo sapiens (Human)
Description:
Receptor binding assays were performed using human clone stably expressed in CHO cells.
Residue:
377
  
Inhibitor
Name:
BDBM50285318
Synonyms:
3-(4-{5-[4-(5-carbamoyl-1H-3-indolyl)-3-cyclohexenylamino]pentylamino}-1-cyclohexenyl)-1H-5-indolecarboxamide | CHEMBL17828
Type:
Small organic molecule
Emp. Form.:
C35H42N6O2
Mol. Mass.:
578.747
SMILES:
NC(=O)c1ccc2[nH]cc(C3=CCC(CC3)NCCCCCNC3CCC(=CC3)c3c[nH]c4ccc(cc34)C(N)=O)c2c1
: