Target
Matrix metalloproteinase-9
Ligand
BDBM50031790
Substrate
Meas. Tech.
ChEBML_105391
Ki
0.310000±n/a nM
Citation
 Wahl, RCPulvino, TAMathiowetz, AMGhose, AKJohnson, JSDelecki, DCook, ERGainor, JAGowravaram, MRTomczuk, BE Hydroxamate inhibitors of human gelatinase B (92 kDa) Bioorg Med Chem Lett 5:349-352 (1995)    Article 
Target
Name:
Matrix metalloproteinase-9
Synonyms:
67 kDa matrix metalloproteinase-9 92 kDa gelatinase CLG4B Gelatinase B MMP9 Matrix metalloproteinase 9 (MMP-9) Matrix metalloproteinase-9 (MMP9)
Type:
Enzyme
Mol. Mass.:
78452.28
Organism:
Homo sapiens (Human)
Description:
P14780
Residue:
707
  
Inhibitor
Name:
BDBM50031790
Synonyms:
(R)-N*4*-Hydroxy-N*1*-((S)-1-methylcarbamoyl-2-phenyl-ethyl)-2-(5-phenoxy-pentyl)-succinamide CHEMBL59023
Type:
Small organic molecule
Emp. Form.:
C25H33N3O5
Mol. Mass.:
455.5466
SMILES:
CNC(=O)[C@H](Cc1ccccc1)NC(=O)[C@H](CCCCCOc1ccccc1)CC(=O)NO
: