Target
Angiotensin-converting enzyme 2
Ligand
BDBM50286723
Substrate
Meas. Tech.
ChEMBL_35591 (CHEMBL648287)
IC50
27±n/a nM
Citation
 Bhagwat, SSFink, CAGude, CChan, KQiao, YSakane, YBerry, CGhai, RD α-Mercaptoacyl dipeptides that inhibit angiotensin converting enzyme and neutral endopeptidase 24.11 Bioorg Med Chem Lett 5:735-738 (1995)    Article 
Target
Name:
Angiotensin-converting enzyme 2
Synonyms:
ACEI-ACE2 | Angiotensin-converting enzyme
Type:
Mol. Mass.:
Description:
ASSAY_ID of EBI is 35589
Components:
This complex has 2 components.
Component 1
Name:
Angiotensin-converting enzyme
Synonyms:
ACE Angiotensin converting enzyme (ACE) Angiotensin-converting enzyme, soluble form CD_antigen=CD143 DCP1 Kininase II
Type:
Enzyme
Mol. Mass.:
149709.01
Organism:
Homo sapiens (Human)
Description:
Residue:
1306
  
Component 2
Name:
Angiotensin-converting enzyme 2
Synonyms:
ACE-related carboxypeptidase ACE2_HUMAN Angiotensin-converting enzyme homolog Metalloprotease MPROT15
Type:
Enzyme
Mol. Mass.:
92448.86
Organism:
Homo sapiens (Human)
Description:
Residue:
805
  
Inhibitor
Name:
BDBM50286723
Synonyms:
(S)-1-[(S)-2-((R)-2-Mercapto-3-phenyl-propionylamino)-3-naphthalen-1-yl-propionyl]-pyrrolidine-2-carboxylic acid | CHEMBL350378
Type:
Small organic molecule
Emp. Form.:
C27H28N2O4S
Mol. Mass.:
476.587
SMILES:
OC(=O)[C@@H]1CCCN1C(=O)[C@H](Cc1cccc2ccccc12)NC(=O)[C@H](S)Cc1ccccc1
: