Target
Cholecystokinin receptor type A
Ligand
BDBM50286901
Substrate
Meas. Tech.
ChEBML_50038
IC50
232±n/a nM
Citation
 Semple, GRyder, HKendrick, DASzelke, MOhta, MSatoh, MNishida, AAkuzawa, SMiyata, K Synthesis and biological activity of 5-heteroaryl benzodiazepines: analogues of YM022 Bioorg Med Chem Lett 6:55-58 (1996)    Article 
Target
Name:
Cholecystokinin receptor type A
Synonyms:
CCKAR_RAT Cholecystokinin peripheral Cholecystokinin receptor type A
Type:
Enzyme Catalytic Domain
Mol. Mass.:
49676.37
Organism:
RAT
Description:
Cholecystokinin central 0 RAT::P30551
Residue:
444
  
Inhibitor
Name:
BDBM50286901
Synonyms:
1-[1-(3,3-Dimethyl-2-oxo-butyl)-5-(1H-imidazol-4-yl)-2-oxo-2,3-dihydro-1H-benzo[e][1,4]diazepin-3-yl]-3-m-tolyl-urea | CHEMBL434126
Type:
Small organic molecule
Emp. Form.:
C26H28N6O3
Mol. Mass.:
472.5389
SMILES:
Cc1cccc(NC(=O)NC2N=C(c3cnc[nH]3)c3ccccc3N(CC(=O)C(C)(C)C)C2=O)c1
: