Target
Angiotensin-converting enzyme 2
Ligand
BDBM50288349
Substrate
Meas. Tech.
ChEMBL_36009 (CHEMBL644716)
IC50
41±n/a nM
Citation
 Lombaert, SDBlanchard, LStamford, LBSakane, YBerry, CGhai, RDTrapani, AJ Dual inhibition of angiotensin-converting enzyme and neutral endopeptidase by tricyclic benzazepinone thiols Bioorg Med Chem Lett 6:2875-2880 (1996)    Article 
Target
Name:
Angiotensin-converting enzyme 2
Synonyms:
ACEI-ACE2 | Angiotensin-converting enzyme
Type:
Mol. Mass.:
Description:
ASSAY_ID of EBI is 35589
Components:
This complex has 2 components.
Component 1
Name:
Angiotensin-converting enzyme
Synonyms:
ACE Angiotensin converting enzyme (ACE) Angiotensin-converting enzyme, soluble form CD_antigen=CD143 DCP1 Kininase II
Type:
Enzyme
Mol. Mass.:
149709.01
Organism:
Homo sapiens (Human)
Description:
Residue:
1306
  
Component 2
Name:
Angiotensin-converting enzyme 2
Synonyms:
ACE-related carboxypeptidase ACE2_HUMAN Angiotensin-converting enzyme homolog Metalloprotease MPROT15
Type:
Enzyme
Mol. Mass.:
92448.86
Organism:
Homo sapiens (Human)
Description:
Residue:
805
  
Inhibitor
Name:
BDBM50288349
Synonyms:
(S)-5-((2S,3R)-2-Mercapto-3-methyl-pentanoylamino)-4-oxo-1,2,4,5,6,7-hexahydro-azepino[3,2,1-hi]indole-2-carboxylic acid | CHEMBL319836
Type:
Small organic molecule
Emp. Form.:
C19H24N2O4S
Mol. Mass.:
376.47
SMILES:
CC[C@@H](C)[C@H](S)C(=O)NC1CCc2cccc3C[C@H](N(c23)C1=O)C(O)=O
: