Target
Prothrombin
Ligand
BDBM50288405
Substrate
Meas. Tech.
ChEBML_208357
Ki
0.160000±n/a nM
Citation
 Galemmo, RAFevig, JMCarini, DJCacciola, JWells, BLHillyer, GLJr., JBRossi, KAStouten, PFAlexander, RSHilmer, RBostrom, LAbelman, MMLee, SLWeber, PCKettner, CAKnabb, RMWexler, RR (N-acyl-N-alkyl)glycyl borolysine analogs: A new class of potent thrombin inhibitors Bioorg Med Chem Lett 6:2913-2918 (1996)    Article 
Target
Name:
Prothrombin
Synonyms:
Activation peptide fragment 1 Coagulation factor II Prothrombin precursor Thrombin heavy chain | Thrombin light chain
Type:
Protein
Mol. Mass.:
70029.57
Organism:
Homo sapiens (Human)
Description:
P00734
Residue:
622
  
Inhibitor
Name:
BDBM50288405
Synonyms:
CHEMBL95940 | N-[(1-Dihydroxyboranyl-4-guanidino-butylcarbamoyl)-methyl]-N-methyl-3-phenyl-propionamide
Type:
Small organic molecule
Emp. Form.:
C17H28BN5O4
Mol. Mass.:
377.246
SMILES:
CN(CC(=O)N[C@@H](CCCNC(N)=N)B(O)O)C(=O)CCc1ccccc1
: