Target
72 kDa type IV collagenase
Ligand
BDBM50288674
Substrate
Meas. Tech.
ChEBML_101916
Ki
20±n/a nM
Citation
 Caldwell, CGSahoo, SPPolo, SAEversole, RRLanza, TJMills, SGNiedzwiecki, LMIzquierdo-Martin, MChang, BCHarrison, RKKuo, DWLin, TYStein, RLDurette, PLHagmann, WK Phosphinic acid inhibitors of matrix metalloproteinases Bioorg Med Chem Lett 6:323-328 (1996)    Article 
Target
Name:
72 kDa type IV collagenase
Synonyms:
72 kDa gelatinase CLG4A Gelatinase A (MMP-2) MMP2_HUMAN Matrix metalloproteinase-2 (MMP 2) Matrix metalloproteinases 2 (MMP-2) | TBE-1
Type:
Enzyme
Mol. Mass.:
73870.36
Organism:
Homo sapiens (Human)
Description:
P08253
Residue:
660
  
Inhibitor
Name:
BDBM50288674
Synonyms:
CHEMBL420674 | [4-(1,3-Dioxo-1,3-dihydro-isoindol-2-yl)-butyl]-[(S)-2-((S)-3-methyl-1-phenylcarbamoyl-butylcarbamoyl)-4-phenyl-butyl]-phosphinic acid
Type:
Small organic molecule
Emp. Form.:
C35H42N3O6P
Mol. Mass.:
631.6982
SMILES:
CC(C)C[C@H](NC(=O)[C@H](CCc1ccccc1)CP(O)(=O)CCCCN1C(=O)c2ccccc2C1=O)C(=O)Nc1ccccc1
: