Target
72 kDa type IV collagenase
Ligand
BDBM50288672
Substrate
Meas. Tech.
ChEBML_101916
Ki
2.1±n/a nM
Citation
 Caldwell, CGSahoo, SPPolo, SAEversole, RRLanza, TJMills, SGNiedzwiecki, LMIzquierdo-Martin, MChang, BCHarrison, RKKuo, DWLin, TYStein, RLDurette, PLHagmann, WK Phosphinic acid inhibitors of matrix metalloproteinases Bioorg Med Chem Lett 6:323-328 (1996)    Article 
Target
Name:
72 kDa type IV collagenase
Synonyms:
72 kDa gelatinase CLG4A Gelatinase A (MMP-2) MMP2_HUMAN Matrix metalloproteinase-2 (MMP 2) Matrix metalloproteinases 2 (MMP-2) | TBE-1
Type:
Enzyme
Mol. Mass.:
73870.36
Organism:
Homo sapiens (Human)
Description:
P08253
Residue:
660
  
Inhibitor
Name:
BDBM50288672
Synonyms:
CHEMBL113362 | [4-(1,3-Dioxo-1,3-dihydro-isoindol-2-yl)-butyl]-[(S)-4-(3-methoxy-phenyl)-2-((S)-3-methyl-1-phenylcarbamoyl-butylcarbamoyl)-butyl]-phosphinic acid
Type:
Small organic molecule
Emp. Form.:
C36H44N3O7P
Mol. Mass.:
661.7242
SMILES:
COc1cccc(CC[C@H](CP(O)(=O)CCCCN2C(=O)c3ccccc3C2=O)C(=O)N[C@@H](CC(C)C)C(=O)Nc2ccccc2)c1
: