Target
Stromelysin-1
Ligand
BDBM50288702
Substrate
Meas. Tech.
ChEBML_102083
Ki
8±n/a nM
Citation
 Chapman, KTWales, JSahoo, SPNiedzwiecki, LMIzquierdo-Martin, MChang, BCHarrison, RKStein, RLHagmann, WK Inhibition of matrix metalloproteinases by P1 substituted N-carboxyalkyl dipeptides Bioorg Med Chem Lett 6:329-332 (1996)    Article 
Target
Name:
Stromelysin-1
Synonyms:
MMP-3 MMP3_HUMAN Matrix metalloproteinase 3 Matrix metalloproteinase-3 (MMP-3) SL-1 Stromelysin 1 | Transin-1
Type:
Enzyme
Mol. Mass.:
53973.13
Organism:
Homo sapiens (Human)
Description:
P08254
Residue:
477
  
Inhibitor
Name:
BDBM50288702
Synonyms:
(R)-6-(1,3-Dioxo-1,3-dihydro-isoindol-2-yl)-2-[(S)-1-((S)-3-methyl-1-phenylcarbamoyl-butylcarbamoyl)-3-phenyl-propylamino]-hexanoic acid CHEMBL112180
Type:
Small organic molecule
Emp. Form.:
C36H42N4O6
Mol. Mass.:
626.7419
SMILES:
CC(C)C[C@H](NC(=O)[C@H](CCc1ccccc1)N[C@H](CCCCN1C(=O)c2ccccc2C1=O)C(O)=O)C(=O)Nc1ccccc1
: