Target
Lysosomal alpha-glucosidase
Ligand
BDBM50104412
Substrate
Meas. Tech.
ChEBML_216948
IC50
>1000000±n/a nM
Citation
 Igarashi, YIchikawa, MIchikawa, Y Synthesis of a new inhibitor of α-fucosidase Bioorg Med Chem Lett 6:553-558 (1996)    Article 
Target
Name:
Lysosomal alpha-glucosidase
Synonyms:
70 kDa lysosomal alpha-glucosidase Acid maltase Alpha glucosidase LYAG_HUMAN
Type:
PROTEIN
Mol. Mass.:
105312.45
Organism:
Homo sapiens (Human)
Description:
ChEMBL_1506060
Residue:
952
  
Inhibitor
Name:
BDBM50104412
Synonyms:
(S)-5-Methyl-piperidine-3,4-diol | CHEMBL86305
Type:
Small organic molecule
Emp. Form.:
C6H13NO2
Mol. Mass.:
131.1729
SMILES:
CC1CNC[C@H](O)C1O
: