Target
5-hydroxytryptamine receptor 2A
Ligand
BDBM50017721
Substrate
Meas. Tech.
ChEBML_2673
Ki
5±n/a nM
Citation
 Mokrosz, MJDuszynska, BKlodzinska, ADeren-Wesolek, AChojnacka-Wójcik, EBaranowski, TCAbdou, IMRedmore, NPStrekowski, L 4-(3-furyl)-2-(4-methylpiperazino)pyrimidines: Potent 5-HT2A receptor antagonists Bioorg Med Chem Lett 7:1635-1638 (1997)    Article 
Target
Name:
5-hydroxytryptamine receptor 2A
Synonyms:
5-HT-2A 5-HT2A 5-hydroxytryptamine receptor 2A (5HT2A) Htr2 Serotonin Receptor 2A
Type:
G Protein-Coupled Receptor (GPCR)
Mol. Mass.:
52852.05
Organism:
Rattus norvegicus (rat)
Description:
Rat cortex membranes 5-HT2A receptors.
Residue:
471
  
Inhibitor
Name:
BDBM50017721
Synonyms:
1-Methyl-4-(5H-dibenzo(a,d)cycloheptenylidene)piperidine 4-(5-dibenzo(a,d)cyclohepten-5-ylidine)-1-methylpiperidine 4-(5H-dibenzo[a,d][7]annulen-5-ylidene)-1-methylpiperidine4-(5H-dibenzo[a,d]cyclohepten-5-ylidene)-1-methylpiperidine CHEMBL516 | CYPROHEPTADINE
Type:
Small organic molecule
Emp. Form.:
C21H21N
Mol. Mass.:
287.3981
SMILES:
[#6]-[#7]-1-[#6]-[#6]\[#6](-[#6]-[#6]-1)=[#6]-1/c2ccccc2-[#6]=[#6]-c2ccccc-12
: