Target
Prostatic acid phosphatase
Ligand
BDBM50289997
Substrate
Meas. Tech.
ChEBML_158625
IC50
8.6±n/a nM
Citation
 Frechette, RFAckerman, CBeers, SLook, RMoore, J Novel hydroxyphosphonate inhibitors of CD-45 tyrosine phosphatase Bioorg Med Chem Lett 7:2169-2172 (1997)    Article 
Target
Name:
Prostatic acid phosphatase
Synonyms:
ACP3 PPAP_HUMAN | Prostatic acid phosphatase
Type:
PROTEIN
Mol. Mass.:
44563.07
Organism:
Homo sapiens (Human)
Description:
ChEMBL_158625
Residue:
386
  
Inhibitor
Name:
BDBM50289997
Synonyms:
(Benzylamino-naphthalen-1-yl-methyl)-phosphonic acid | CHEMBL68858
Type:
Small organic molecule
Emp. Form.:
C18H18NO3P
Mol. Mass.:
327.3142
SMILES:
OP(O)(=O)C(NCc1ccccc1)c1cccc2ccccc12
: