Target
Sodium-dependent serotonin transporter
Ligand
BDBM82217
Substrate
Ki
0.047±n/a nM
Comments
PDSP_1710
Citation
 Cheetham, SCViggers, JASlater, NAHeal, DJBuckett, WR [3H]paroxetine binding in rat frontal cortex strongly correlates with [3H]5-HT uptake: effect of administration of various antidepressant treatments. Neuropharmacology 32:737-43 (1993)  
Target
Name:
Sodium-dependent serotonin transporter
Synonyms:
5-HT Transporter 5HT transporter Anandamid membrane transporter, AMT Monoamine transporters; Norepinephrine & serotonin Slc6a4 Sodium-dependent serotonin transporter (SERT) | imipramine receptor
Type:
Multi-pass membrane protein
Mol. Mass.:
70168.43
Organism:
Rattus norvegicus (rat)
Description:
P31652
Residue:
630
  
Inhibitor
Name:
BDBM82217
Synonyms:
CHEMBL284994 SERTRALINE | [4-(3,4-Dichloro-phenyl)-1,2,3,4-tetrahydro-naphthalen-1-yl]-methyl-amine
Type:
Emp. Form.:
C17H17Cl2N
Mol. Mass.:
306.23
SMILES:
CN[C@@H]1CC[C@@H](c2ccc(Cl)c(Cl)c2)c2ccccc12
: