Target
D(3) dopamine receptor
Ligand
BDBM50020221
Substrate
Meas. Tech.
ChEBML_62936
Ki
4.4±n/a nM
Citation
 Stjernlöf, PLin, CHSonesson, CSvensson, KSmith, MW (Dipropylamino)-tetrahydronaphthofurans: centrally acting serotonin agonists and dopamine agonists-antagonists Bioorg Med Chem Lett 7:2759-2764 (1997)    Article 
Target
Name:
D(3) dopamine receptor
Synonyms:
DOPAMINE D3 DRD3_HUMAN Dopamine D3 receptor (D3) Dopamine receptor Dopamine receptor D3
Type:
Mol. Mass.:
44243.43
Organism:
Homo sapiens (Human)
Description:
Residue:
400
  
Inhibitor
Name:
BDBM50020221
Synonyms:
(-)-5-hydroxy-2-(dipropylamino)tetralin 5-hydroxy-2-(dipropylamino)tetralin 6-Dipropylamino-5,6,7,8-tetrahydro-naphthalen-1-ol (DP-5-ADTN) | CHEMBL273273
Type:
Small organic molecule
Emp. Form.:
C16H25NO
Mol. Mass.:
247.3758
SMILES:
CCCN(CCC)C1CCc2c(O)cccc2C1
: