Target
D(4) dopamine receptor
Ligand
BDBM50034342
Substrate
Meas. Tech.
ChEBML_60997
Ki
>4067±n/a nM
Citation
 Stjernlöf, PLin, CHSonesson, CSvensson, KSmith, MW (Dipropylamino)-tetrahydronaphthofurans: centrally acting serotonin agonists and dopamine agonists-antagonists Bioorg Med Chem Lett 7:2759-2764 (1997)    Article 
Target
Name:
D(4) dopamine receptor
Synonyms:
D(2C) dopamine receptor DOPAMINE D4.2 DRD4 Dopamine D4 receptor
Type:
Enzyme
Mol. Mass.:
48373.19
Organism:
Homo sapiens (Human)
Description:
P21917
Residue:
419
  
Inhibitor
Name:
BDBM50034342
Synonyms:
(3aR,9bS) 3-Propyl-2,3,3a,4,5,9b-hexahydro-1H-benzo[e]indol-9-ol (3aS,9bR) 3-Propyl-2,3,3a,4,5,9b-hexahydro-1H-benzo[e]indol-9-ol CHEMBL430332
Type:
Small organic molecule
Emp. Form.:
C15H21NO
Mol. Mass.:
231.3333
SMILES:
CCCN1CC[C@@H]2[C@H]1CCc1cccc(O)c21
: