Target
Maltase-glucoamylase
Ligand
BDBM50291021
Substrate
Meas. Tech.
ChEBML_70932
Ki
120±n/a nM
Citation
 Lesur, BDucep, JBLalloz, MNEhrhard, ADanzin, C New deoxynojirimycin derivatives as potent inhibitors of intestinal α-glucohydrolases Bioorg Med Chem Lett 7:355-360 (1997)    Article 
Target
Name:
Maltase-glucoamylase
Synonyms:
Alpha glucosidase MGA MGAML Maltase | Maltase-glucoamylase, intestinal
Type:
Enzyme
Mol. Mass.:
209817.06
Organism:
Homo sapiens (Human)
Description:
O43451
Residue:
1857
  
Inhibitor
Name:
BDBM50291021
Synonyms:
(2R,3R,4R,5S)-2-Hydroxymethyl-1-(4-trimethylsilanyl-butyl)-piperidine-3,4,5-triol | CHEMBL415713
Type:
Small organic molecule
Emp. Form.:
C13H29NO4Si
Mol. Mass.:
291.4592
SMILES:
C[Si](C)(C)CCCCN1C[C@H](O)[C@@H](O)[C@H](O)[C@H]1CO
: