Target
Metalloproteinase inhibitor 3
Ligand
BDBM50291442
Substrate
Meas. Tech.
ChEBML_104887
IC50
>100000±n/a nM
Citation
 Baxter, ADBird, JBhogal, RMassil, TMinton, KJMontana, JOwen, DA A novel series of matrix metalloproteinase inhibitors for the treatment of inflammatory disorders Bioorg Med Chem Lett 7:897-902 (1997)    Article 
Target
Name:
Metalloproteinase inhibitor 3
Synonyms:
TIMP3_RAT Timp3 Tissue inhibitor of metalloproteinases-3
Type:
PROTEIN
Mol. Mass.:
24241.51
Organism:
Rattus norvegicus
Description:
ChEMBL_10750
Residue:
211
  
Inhibitor
Name:
BDBM50291442
Synonyms:
(S)-4-Methyl-2-propionylamino-pentanoic acid ((S)-1-methylcarbamoyl-2-phenyl-ethyl)-amide | CHEMBL170095
Type:
Small organic molecule
Emp. Form.:
C19H29N3O3
Mol. Mass.:
347.4519
SMILES:
CCC(=O)N[C@@H](CC(C)C)C(=O)N[C@@H](Cc1ccccc1)C(=O)NC
: