Target
Epidermal growth factor receptor
Ligand
BDBM50292509
Substrate
Meas. Tech.
ChEMBL_506208 (CHEMBL941412)
Ki
20000±n/a nM
Citation
 Chang, CJGeahlen, RL Protein-Tyrosine Kinase Inhibition: Mechanism-Based Discovery of Antitumor Agents J Nat Prod 55:1529-1560 (1992)  
Target
Name:
Epidermal growth factor receptor
Synonyms:
EGF Receptor Substrate EGFR_HUMAN ERBB1 Epidermal Growth Factor Receptor erbB-1 Epidermal growth factor receptor (EGFR) HER1 Proto-oncogene c-ErbB-1 Tyrosine-Protein Kinase ErbB-1
Type:
Receptor Kinase Domain
Mol. Mass.:
134279.59
Organism:
Homo sapiens (Human)
Description:
P00533
Residue:
1210
  
Inhibitor
Name:
BDBM50292509
Synonyms:
(8S,11S,14S,17S,20S,23S)-23-((S)-2-((S)-2-((S)-2-amino-5-guanidinopentanamido)-5-guanidinopentanamido)-4-methylpentanamido)-11,14,17,20-tetrakis(2-carboxyethyl)-8-methyl-4,7,10,13,16,19,22-heptaoxo-5-(2,3,5,6-tetrafluoro-4-hydroxybenzyl)-3,6,9,12,15,18,21-heptaazahexacosane-1,26-dioic acid | CHEMBL2372245
Type:
Small organic molecule
Emp. Form.:
C57H85F4N17O23
Mol. Mass.:
1452.3785
SMILES:
CC(C)C[C@H](NC(=O)[C@H](CCCNC(N)=N)NC(=O)[C@@H](N)CCCNC(N)=N)C(=O)N[C@@H](CCC(O)=O)C(=O)N[C@@H](CCC(O)=O)C(=O)N[C@@H](CCC(O)=O)C(=O)N[C@@H](CCC(O)=O)C(=O)N[C@@H](CCC(O)=O)C(=O)N[C@@H](C)C(=O)N[C@@H](Cc1c(F)c(F)c(O)c(F)c1F)C(=O)NCC(O)=O
: