Target
Tyrosine-protein kinase transforming protein Abl
Ligand
BDBM50292495
Substrate
Meas. Tech.
ChEMBL_506213 (CHEMBL942402)
IC50
200000±n/a nM
Citation
 Chang, CJGeahlen, RL Protein-Tyrosine Kinase Inhibition: Mechanism-Based Discovery of Antitumor Agents J Nat Prod 55:1529-1560 (1992)  
Target
Name:
Tyrosine-protein kinase transforming protein Abl
Synonyms:
ABL Tyrosine-protein kinase V-ABL
Type:
Enzyme
Mol. Mass.:
81895.89
Organism:
Abelson murine leukemia virus
Description:
P00521
Residue:
746
  
Inhibitor
Name:
BDBM50292495
Synonyms:
((2R,3S,4R,5R)-5-(6-amino-9H-purin-9-yl)-3,4-dihydroxytetrahydrofuran-2-yl)methyl 4-(fluorosulfonyl)benzoate | CHEMBL490985
Type:
Small organic molecule
Emp. Form.:
C17H16FN5O7S
Mol. Mass.:
453.402
SMILES:
Nc1ncnc2n(cnc12)[C@@H]1O[C@H](COC(=O)c2ccc(cc2)S(F)(=O)=O)[C@@H](O)[C@H]1O
: