Target
Angiotensin-converting enzyme
Ligand
BDBM50292545
Substrate
Meas. Tech.
ChEMBL_483395 (CHEMBL964320)
IC50
769000±n/a nM
Citation
 Chen, CHLin, JYLin, CNHsu, SY Inhibition of Angiotensin-I-Converting Enzyme by Tetrahydroxyxanthones Isolated from Tripterospermum lanceolatum J Nat Prod 55:691-695 (1992)  
Target
Name:
Angiotensin-converting enzyme
Synonyms:
ACE Angiotensin converting enzyme (ACE) Angiotensin-converting enzyme, soluble form CD_antigen=CD143 DCP1 Kininase II
Type:
Enzyme
Mol. Mass.:
149709.01
Organism:
Homo sapiens (Human)
Description:
Residue:
1306
  
Inhibitor
Name:
BDBM50292545
Synonyms:
2,3,6,7-Tethrahydroxyxanthone | CHEMBL12700
Type:
Small organic molecule
Emp. Form.:
C13H8O6
Mol. Mass.:
260.199
SMILES:
Oc1cc2oc3cc(O)c(O)cc3c(=O)c2cc1O
: