Target
D(1A) dopamine receptor
Ligand
BDBM50292559
Substrate
Meas. Tech.
ChEMBL_483725 (CHEMBL997480)
IC50
>30000±n/a nM
Citation
 Cortes, DFigadere, BSaez, JProtais, P Displacement Activity of Bisbenzylisoquinoline Alkaloids at Striatal 3H-SCH 23390 and 3H-Raclopride Binding Sites J Nat Prod 55:1281-1286 (1992)  
Target
Name:
D(1A) dopamine receptor
Synonyms:
DOPAMINE D1 Dopamine D1 high Dopamine receptor Dopamine1-like Drd1a
Type:
Enzyme Catalytic Domain
Mol. Mass.:
49429.75
Organism:
RAT
Description:
P18901
Residue:
446
  
Inhibitor
Name:
BDBM50292559
Synonyms:
(S)-secoobaberine hydrochloride | CHEMBL451463
Type:
Small organic molecule
Emp. Form.:
C38H40N2O8
Mol. Mass.:
652.7328
SMILES:
COc1ccc(C=O)cc1Oc1ccc(C[C@@H]2N(C)CCc3cc(OC)c(OC)c(Oc4cc5C(=O)N(C)CCc5cc4OC)c23)cc1
: